{"text_format":"1","workbook":"xlsx","n_sheets":14,"sheets":["Summary Data","Overview","Sectoral Analysis","Indicator Analysis","Summary Charts (3)","Bank Analysis","Detailed lending data","Tabulated impacts","Ranking","Sheet3","Bradesco","CEF","HSBC","All"],"not_rendered":{"charts":19,"images":4,"macros":1,"external_links":0,"defined_names":1,"comments":1,"pivot_tables":1},"unopened":[],"bounds":{"document_bytes":16777216,"sheet_cells":100000,"rows_first":2000,"rows_last":500,"rows_between":2000,"halvings":0,"cell_chars":16384,"cell_head_chars":4096},"cells_cut":0,"cells_raw":0,"read":"whole","date_system":"1900"}

{"sheet":"Summary Data","index":0,"n_rows":29,"n_cols":5,"rows_kept":29,"cut":false,"hidden":false,"merged":[]}
[]
[]
[]
[]
[]
[]
[]
[null,"Client Sector","Credit exposure (BRLm)","Natural Capital Impact (BRLm)","NCER ratio"]
[null,"Agriculture",56,{"$f":"C9*E9","v":93.298413808896242},{"$f":"VLOOKUP($B9,'Bank Analysis'!$O$52:$R$71,4,0)","v":1.6660431037302901}]
[null,"Automobiles",504,220.82479384756039,{"$f":"VLOOKUP($B10,'Bank Analysis'!$O$52:$R$71,4,0)","v":0.43814443223722299}]
{"$rows_left_out":20}
{"sheet":"Overview","index":1,"n_rows":44,"n_cols":11,"rows_kept":44,"cut":false,"hidden":false,"merged":[]}
[]
[]
[]
[]
[]
[]
[]
[]
[]
[]
{"$rows_left_out":35}
{"sheet":"Sectoral Analysis","index":2,"n_rows":0,"n_cols":0,"rows_kept":0,"cut":false,"hidden":false,"merged":[]}

{"sheet":"Indicator Analysis","index":3,"n_rows":0,"n_cols":0,"rows_kept":0,"cut":false,"hidden":false,"merged":[]}

{"sheet":"Summary Charts (3)","index":4,"n_rows":0,"n_cols":0,"rows_kept":0,"cut":false,"hidden":true,"merged":[]}

{"sheet":"Bank Analysis","index":5,"n_rows":234,"n_cols":28,"rows_kept":234,"cut":false,"hidden":true,"merged":[[25,15,25,17],[49,4,49,5],[49,11,49,12],[49,15,49,17]]}
[]
[]
["Row Labels","Sum of Credit Exposure (BRLm)","Sum of GHG Direct (BRLm)","Sum of GHG Indirect (BRLm)","Sum of Air Pollution Direct (BRLm)","Sum of Air Pollution Indirect (BRLm)","Sum of Waste Direct (BRLm)","Sum of Waste Indirect (BRLm)","Sum of Land Use Direct (BRLm)","Sum of Land Use Indirect (BRLm)","Sum of Water Direct (BRLm)","Sum of Water Indirect (BRLm)","Sum of Water Pollutants Direct (BRLm)","Sum of Water Pollutants Indirect (BRLm)"]
["Agriculture",56,4.4688997642526758,2.7347716769816537,1.3064066299351558,19.239491104266005,0.18180338118551126,1.6204649796423742,44.360821008708939,6.5335087388615394,0.16162938190790993,1.3164146553701863,10.203556598412074,1.170645889372224]
["Chemicals",600,257.02367584299094,142.8266816335836,1.4563120180384153,155.40901573320721,2.3964905811091519,93.121100437366579,3.5010137899408836E-2,41.81647375822638,0.89252965534155571,10.746443524027182,1.1773873345531708E-2,14.833234327545775]
["Construction",200,70.660480836214774,41.203787703084664,3.339051546631608,9.846214572422527,1.0009005497544614,23.983596149600203,3.3382728541464284E-2,5.1524996539993175,3.8190360269458955E-2,0.51998646629147927,7.6619135199712117E-4,1.3771411395600024]
["Energy",546,9.638361693926005E-2,20.797860474641407,5.494795896104848,8.7446777366960955,0.18819362157658115,52.741183148533096,3.8243266203065476,19.35983454233234,1.9585292950918558,0.63505787397734159,0,1.5614766586266269]
["Fishing",344,1.538293253621855E-5,43.543173698864912,0,14.017564731914025,3.7940736652309566,13.662736942414462,0,85.109735889589331,1712.4706244184574,491.06100410137884,0,123.41776099941599]
["Food and Beverage",91,1.9216433390616321,52.986736990025321,1.7340333169900374E-2,11.028847663329092,0.29953311287628942,5.8796715721925921,5.8165932017425447E-3,39.471123861202756,2.6696610545828012E-3,83.901022309798506,5.0414669415737335E-5,54.01555440544616]
["Forestry",470,11.505409557720775,8.0976072571330331,0.52914722468354847,4.1466822622735764,1.5029024758503999,6.4791131661667585,0,127.71733187315327,0,0.31087194211558949,0,14.255224666455236]
{"$rows_left_out":225}
{"sheet":"Detailed lending data","index":6,"n_rows":45,"n_cols":16,"rows_kept":45,"cut":false,"hidden":true,"merged":[]}
[null,null,null,null,2,{"$f":"E1+1","v":3},{"$f":"F1+1","v":4},5,6,7,8,9,10,11,12,13]
["Super Sector","Trucost Sector","Trucost Sector Number","Credit Exposure (BRLm)","GHG Direct (BRLm)","GHG Indirect (BRLm)","Air Pollution Direct (BRLm)","Air Pollution Indirect (BRLm)","Waste Direct (BRLm)","Waste Indirect (BRLm)","Land Use Direct (BRLm)","Land Use Indirect (BRLm)","Water Direct (BRLm)","Water Indirect (BRLm)","Water Pollutants Direct (BRLm)","Water Pollutants Indirect (BRLm)"]
["Petrochemicals","Petrochemical manufacturing",325110,{"$f":"IFERROR(VLOOKUP(A3,'Summary Data'!$B$9:$C$28,2,0),\"\")/COUNTIF('Detailed lending data'!$A$3:$A$45,'Detailed lending data'!A3)","v":62},{"$f":"$D3*VLOOKUP($C3,'Tabulated impacts'!$B$4:$N$48,E$1,0)","v":13.991169460780274},{"$f":"$D3*VLOOKUP($C3,'Tabulated impacts'!$B$4:$N$48,F$1,0)","v":12.85555896081893},{"$f":"$D3*VLOOKUP($C3,'Tabulated impacts'!$B$4:$N$48,G$1,0)","v":7.4212375263720848E-2},{"$f":"$D3*VLOOKUP($C3,'Tabulated impacts'!$B$4:$N$48,H$1,0)","v":5.1950893604786508},{"$f":"$D3*VLOOKUP($C3,'Tabulated impacts'!$B$4:$N$48,I$1,0)","v":9.1167018891906246E-2},{"$f":"$D3*VLOOKUP($C3,'Tabulated impacts'!$B$4:$N$48,J$1,0)","v":10.056392746316599},{"$f":"$D3*VLOOKUP($C3,'Tabulated impacts'!$B$4:$N$48,K$1,0)","v":1.3566855221497346E-4},{"$f":"$D3*VLOOKUP($C3,'Tabulated impacts'!$B$4:$N$48,L$1,0)","v":6.1820880049796614},{"$f":"$D3*VLOOKUP($C3,'Tabulated impacts'!$B$4:$N$48,M$1,0)","v":9.8298242554625964E-3},{"$f":"$D3*VLOOKUP($C3,'Tabulated impacts'!$B$4:$N$48,N$1,0)","v":0.13745001876539473},{"$f":"$D3*VLOOKUP($C3,'Tabulated impacts'!$B$4:$N$48,O$1,0)","v":2.0981420336580437E-3},{"$f":"$D3*VLOOKUP($C3,'Tabulated impacts'!$B$4:$N$48,P$1,0)","v":3.4007601423535254}]
["Energy","Hydroelectric Power Generation",221111,{"$f":"IFERROR(VLOOKUP(A4,'Summary Data'!$B$9:$C$28,2,0),\"\")/COUNTIF($A$3:$A$45,A4)","v":182},{"$f":"$D4*VLOOKUP($C4,'Tabulated impacts'!$B$4:$N$48,E$1,0)","v":0},{"$f":"$D4*VLOOKUP($C4,'Tabulated impacts'!$B$4:$N$48,F$1,0)","v":6.1597017900897439},{"$f":"$D4*VLOOKUP($C4,'Tabulated impacts'!$B$4:$N$48,G$1,0)","v":0.72235749037541097},{"$f":"$D4*VLOOKUP($C4,'Tabulated impacts'!$B$4:$N$48,H$1,0)","v":2.5700684761159001},{"$f":"$D4*VLOOKUP($C4,'Tabulated impacts'!$B$4:$N$48,I$1,0)","v":5.5412883281755546E-2},{"$f":"$D4*VLOOKUP($C4,'Tabulated impacts'!$B$4:$N$48,J$1,0)","v":15.587740826472094},{"$f":"$D4*VLOOKUP($C4,'Tabulated impacts'!$B$4:$N$48,K$1,0)","v":3.6084526071326617},{"$f":"$D4*VLOOKUP($C4,'Tabulated impacts'!$B$4:$N$48,L$1,0)","v":5.7178718572724652},{"$f":"$D4*VLOOKUP($C4,'Tabulated impacts'!$B$4:$N$48,M$1,0)","v":1.9585292950918558},{"$f":"$D4*VLOOKUP($C4,'Tabulated impacts'!$B$4:$N$48,N$1,0)","v":0.19478822423879594},{"$f":"$D4*VLOOKUP($C4,'Tabulated impacts'!$B$4:$N$48,O$1,0)","v":0},{"$f":"$D4*VLOOKUP($C4,'Tabulated impacts'!$B$4:$N$48,P$1,0)","v":0.45980930897300032}]
["Energy","Electric Power distribution",221122,{"$f":"IFERROR(VLOOKUP(A5,'Summary Data'!$B$9:$C$28,2,0),\"\")/COUNTIF('Detailed lending data'!$A$3:$A$45,'Detailed lending data'!A5)","v":182},{"$f":"$D5*VLOOKUP($C5,'Tabulated impacts'!$B$4:$N$48,E$1,0)","v":4.1820091183074989E-2},{"$f":"$D5*VLOOKUP($C5,'Tabulated impacts'!$B$4:$N$48,F$1,0)","v":7.3186097866965421},{"$f":"$D5*VLOOKUP($C5,'Tabulated impacts'!$B$4:$N$48,G$1,0)","v":0.65496970363851614},{"$f":"$D5*VLOOKUP($C5,'Tabulated impacts'!$B$4:$N$48,H$1,0)","v":3.0779057985263227},{"$f":"$D5*VLOOKUP($C5,'Tabulated impacts'!$B$4:$N$48,I$1,0)","v":6.6390369147412795E-2},{"$f":"$D5*VLOOKUP($C5,'Tabulated impacts'!$B$4:$N$48,J$1,0)","v":18.576567575429397},{"$f":"$D5*VLOOKUP($C5,'Tabulated impacts'!$B$4:$N$48,K$1,0)","v":0},{"$f":"$D5*VLOOKUP($C5,'Tabulated impacts'!$B$4:$N$48,L$1,0)","v":6.8203873381339939},{"$f":"$D5*VLOOKUP($C5,'Tabulated impacts'!$B$4:$N$48,M$1,0)","v":0},{"$f":"$D5*VLOOKUP($C5,'Tabulated impacts'!$B$4:$N$48,N$1,0)","v":0.22013363803190303},{"$f":"$D5*VLOOKUP($C5,'Tabulated impacts'!$B$4:$N$48,O$1,0)","v":0},{"$f":"$D5*VLOOKUP($C5,'Tabulated impacts'!$B$4:$N$48,P$1,0)","v":0.55083370198252746}]
["Energy","Electric Bulk Power Transmission and Control",221121,{"$f":"IFERROR(VLOOKUP(A6,'Summary Data'!$B$9:$C$28,2,0),\"\")/COUNTIF('Detailed lending data'!$A$3:$A$45,'Detailed lending data'!A6)","v":182},{"$f":"$D6*VLOOKUP($C6,'Tabulated impacts'!$B$4:$N$48,E$1,0)","v":5.4563525756185061E-2},{"$f":"$D6*VLOOKUP($C6,'Tabulated impacts'!$B$4:$N$48,F$1,0)","v":7.3195488978551202},{"$f":"$D6*VLOOKUP($C6,'Tabulated impacts'!$B$4:$N$48,G$1,0)","v":4.1174687020909211},{"$f":"$D6*VLOOKUP($C6,'Tabulated impacts'!$B$4:$N$48,H$1,0)","v":3.0967034620538718},{"$f":"$D6*VLOOKUP($C6,'Tabulated impacts'!$B$4:$N$48,I$1,0)","v":6.6390369147412795E-2},{"$f":"$D6*VLOOKUP($C6,'Tabulated impacts'!$B$4:$N$48,J$1,0)","v":18.576874746631599},{"$f":"$D6*VLOOKUP($C6,'Tabulated impacts'!$B$4:$N$48,K$1,0)","v":0.21587401317388591},{"$f":"$D6*VLOOKUP($C6,'Tabulated impacts'!$B$4:$N$48,L$1,0)","v":6.8215753469258811},{"$f":"$D6*VLOOKUP($C6,'Tabulated impacts'!$B$4:$N$48,M$1,0)","v":0},{"$f":"$D6*VLOOKUP($C6,'Tabulated impacts'!$B$4:$N$48,N$1,0)","v":0.22013601170664268},{"$f":"$D6*VLOOKUP($C6,'Tabulated impacts'!$B$4:$N$48,O$1,0)","v":0},{"$f":"$D6*VLOOKUP($C6,'Tabulated impacts'!$B$4:$N$48,P$1,0)","v":0.55083364767109899}]
["Water","Water Supply and Irrigation Systems and Steam and Air-Conditioning Supply","221300A",{"$f":"IFERROR(VLOOKUP(A7,'Summary Data'!$B$9:$C$28,2,0),\"\")/COUNTIF('Detailed lending data'!$A$3:$A$45,'Detailed lending data'!A7)","v":789},{"$f":"$D7*VLOOKUP($C7,'Tabulated impacts'!$B$4:$N$48,E$1,0)","v":17.356565903228145},{"$f":"$D7*VLOOKUP($C7,'Tabulated impacts'!$B$4:$N$48,F$1,0)","v":13.824936948824206},{"$f":"$D7*VLOOKUP($C7,'Tabulated impacts'!$B$4:$N$48,G$1,0)","v":0.64168119172904059},{"$f":"$D7*VLOOKUP($C7,'Tabulated impacts'!$B$4:$N$48,H$1,0)","v":30.541608096186142},{"$f":"$D7*VLOOKUP($C7,'Tabulated impacts'!$B$4:$N$48,I$1,0)","v":0.15457776293379086},{"$f":"$D7*VLOOKUP($C7,'Tabulated impacts'!$B$4:$N$48,J$1,0)","v":9.7921670808185226},{"$f":"$D7*VLOOKUP($C7,'Tabulated impacts'!$B$4:$N$48,K$1,0)","v":0},{"$f":"$D7*VLOOKUP($C7,'Tabulated impacts'!$B$4:$N$48,L$1,0)","v":3.3523304007779915},{"$f":"$D7*VLOOKUP($C7,'Tabulated impacts'!$B$4:$N$48,M$1,0)","v":18.337037687361892},{"$f":"$D7*VLOOKUP($C7,'Tabulated impacts'!$B$4:$N$48,N$1,0)","v":0.25745578694718707},{"$f":"$D7*VLOOKUP($C7,'Tabulated impacts'!$B$4:$N$48,O$1,0)","v":0},{"$f":"$D7*VLOOKUP($C7,'Tabulated impacts'!$B$4:$N$48,P$1,0)","v":1.0328535278636355}]
["Food and Beverage","Animal (except poultry) slaughtering, rendering, and processing",311920,{"$f":"IFERROR(VLOOKUP(A8,'Summary Data'!$B$9:$C$28,2,0),\"\")/COUNTIF('Detailed lending data'!$A$3:$A$45,'Detailed lending data'!A8)","v":22.75},{"$f":"$D8*VLOOKUP($C8,'Tabulated impacts'!$B$4:$N$48,E$1,0)","v":1.2811042653092648},{"$f":"$D8*VLOOKUP($C8,'Tabulated impacts'!$B$4:$N$48,F$1,0)","v":4.0779062762469698},{"$f":"$D8*VLOOKUP($C8,'Tabulated impacts'!$B$4:$N$48,G$1,0)","v":3.7978049114059959E-3},{"$f":"$D8*VLOOKUP($C8,'Tabulated impacts'!$B$4:$N$48,H$1,0)","v":4.4541700161778399},{"$f":"$D8*VLOOKUP($C8,'Tabulated impacts'!$B$4:$N$48,I$1,0)","v":0.13810566764270502},{"$f":"$D8*VLOOKUP($C8,'Tabulated impacts'!$B$4:$N$48,J$1,0)","v":2.3324063733544667},{"$f":"$D8*VLOOKUP($C8,'Tabulated impacts'!$B$4:$N$48,K$1,0)","v":2.1271886063457413E-3},{"$f":"$D8*VLOOKUP($C8,'Tabulated impacts'!$B$4:$N$48,L$1,0)","v":10.395791087431157},{"$f":"$D8*VLOOKUP($C8,'Tabulated impacts'!$B$4:$N$48,M$1,0)","v":1.463851203289973E-4},{"$f":"$D8*VLOOKUP($C8,'Tabulated impacts'!$B$4:$N$48,N$1,0)","v":1.5280987542624931},{"$f":"$D8*VLOOKUP($C8,'Tabulated impacts'!$B$4:$N$48,O$1,0)","v":0},{"$f":"$D8*VLOOKUP($C8,'Tabulated impacts'!$B$4:$N$48,P$1,0)","v":13.0196055203886}]
["Food and Beverage","Coffee and Tea Manufacturing","31161A",{"$f":"IFERROR(VLOOKUP(A9,'Summary Data'!$B$9:$C$28,2,0),\"\")/COUNTIF('Detailed lending data'!$A$3:$A$45,'Detailed lending data'!A9)","v":22.75},{"$f":"$D9*VLOOKUP($C9,'Tabulated impacts'!$B$4:$N$48,E$1,0)","v":0.23576093405353804},{"$f":"$D9*VLOOKUP($C9,'Tabulated impacts'!$B$4:$N$48,F$1,0)","v":45.182841750195493},{"$f":"$D9*VLOOKUP($C9,'Tabulated impacts'!$B$4:$N$48,G$1,0)","v":3.9653071168553487E-3},{"$f":"$D9*VLOOKUP($C9,'Tabulated impacts'!$B$4:$N$48,H$1,0)","v":4.5959539730784984},{"$f":"$D9*VLOOKUP($C9,'Tabulated impacts'!$B$4:$N$48,I$1,0)","v":8.9911930367161011E-2},{"$f":"$D9*VLOOKUP($C9,'Tabulated impacts'!$B$4:$N$48,J$1,0)","v":2.0854927486922108},{"$f":"$D9*VLOOKUP($C9,'Tabulated impacts'!$B$4:$N$48,K$1,0)","v":8.0945819161159149E-4},{"$f":"$D9*VLOOKUP($C9,'Tabulated impacts'!$B$4:$N$48,L$1,0)","v":9.3969804802906616},{"$f":"$D9*VLOOKUP($C9,'Tabulated impacts'!$B$4:$N$48,M$1,0)","v":1.2055677085802643E-4},{"$f":"$D9*VLOOKUP($C9,'Tabulated impacts'!$B$4:$N$48,N$1,0)","v":81.515236583057415},{"$f":"$D9*VLOOKUP($C9,'Tabulated impacts'!$B$4:$N$48,O$1,0)","v":3.7042429240375437E-5},{"$f":"$D9*VLOOKUP($C9,'Tabulated impacts'!$B$4:$N$48,P$1,0)","v":11.266033433228923}]
["Food and Beverage","Breweries",312120,{"$f":"IFERROR(VLOOKUP(A10,'Summary Data'!$B$9:$C$28,2,0),\"\")/COUNTIF('Detailed lending data'!$A$3:$A$45,'Detailed lending data'!A10)","v":22.75},{"$f":"$D10*VLOOKUP($C10,'Tabulated impacts'!$B$4:$N$48,E$1,0)","v":8.1476622077957916E-2},{"$f":"$D10*VLOOKUP($C10,'Tabulated impacts'!$B$4:$N$48,F$1,0)","v":1.7973316313185339},{"$f":"$D10*VLOOKUP($C10,'Tabulated impacts'!$B$4:$N$48,G$1,0)","v":8.6736472881692329E-3},{"$f":"$D10*VLOOKUP($C10,'Tabulated impacts'!$B$4:$N$48,H$1,0)","v":1.1711630520209397},{"$f":"$D10*VLOOKUP($C10,'Tabulated impacts'!$B$4:$N$48,I$1,0)","v":4.9210323732939397E-2},{"$f":"$D10*VLOOKUP($C10,'Tabulated impacts'!$B$4:$N$48,J$1,0)","v":0.95251476187286677},{"$f":"$D10*VLOOKUP($C10,'Tabulated impacts'!$B$4:$N$48,K$1,0)","v":1.2608846463216749E-3},{"$f":"$D10*VLOOKUP($C10,'Tabulated impacts'!$B$4:$N$48,L$1,0)","v":3.5760361875347026},{"$f":"$D10*VLOOKUP($C10,'Tabulated impacts'!$B$4:$N$48,M$1,0)","v":2.3643704906352861E-3},{"$f":"$D10*VLOOKUP($C10,'Tabulated impacts'!$B$4:$N$48,N$1,0)","v":0.19393103490223984},{"$f":"$D10*VLOOKUP($C10,'Tabulated impacts'!$B$4:$N$48,O$1,0)","v":1.33722401753619E-5},{"$f":"$D10*VLOOKUP($C10,'Tabulated impacts'!$B$4:$N$48,P$1,0)","v":5.9417404183485747}]
{"$rows_left_out":36}
{"sheet":"Tabulated impacts","index":7,"n_rows":48,"n_cols":14,"rows_kept":48,"cut":false,"hidden":true,"merged":[]}
[null,null,"GHG ","GHG ","Air Pollution ","Air Pollution ","Waste ","Waste ","Land Use ","Land Use ","Water ","Water ","Water Pollutants ","Water Pollutants "]
[null,null,"Direct","Indirect","Direct","Indirect","Direct","Indirect","Direct","Indirect","Direct","Indirect","Direct","Indirect"]
["Trucost Sector","Sector Code",{"$f":"C1&C2","v":"GHG Direct"},{"$f":"D1&D2","v":"GHG Indirect"},"Air Pollution Direct","Air Pollution Indirect","Waste Direct","Waste Indirect","Land Use Direct","Land Use Indirect","Water Direct","Water Indirect","Water Pollutants Direct","Water Pollutants Indirect"]
["Animal (except poultry) slaughtering, rendering, and processing","31161A",1.0363117980375298E-2,1.9860589780305711,1.7429921392770763E-4,0.20201995486059335,3.9521727633916931E-3,9.1670010931525756E-2,3.5580579851058968E-5,0.41305408704574337,5.2991987190341288E-6,3.5830873223321942,1.6282386479285906E-6,0.49521026080127134]
["Breweries",312120,3.5813899814486996E-3,7.9003588189825669E-2,3.8125922145798829E-4,5.1479694594327025E-2,2.1630911530962373E-3,4.1868780741664474E-2,5.542350093721648E-5,0.15718840384767924,1.0392837321473784E-4,8.5244410946039486E-3,5.8779077693898463E-7,0.26117540300433295]
["Electric Power distribution",221122,2.297807207861263E-4,4.0212141685145836E-2,3.5987346353764625E-3,1.6911570321573203E-2,3.6478224806270765E-4,0.10206905261224944,0,3.7474655704032932E-2,0,1.2095254836917749E-3,0,3.026558802101799E-3]
["Natural Gas Distribution",221200,7.7330204062220992E-2,7.6082471924921152E-2,6.8474603161988116E-4,1.0736486943018531E-2,5.9229900548004612E-4,0.35056939380501145,1.8932110967033197E-3,0.15723621062637175,6.7284363209353186E-6,9.927604027460072E-4,0,2.5975282589001149E-3]
["Aircraft manufacturing",336411,6.7559619817976404E-4,5.3259498547756919E-2,3.3444649413840913E-5,2.3796027553007769E-2,2.7337692079609116E-3,2.8808289686960149E-2,5.316708256853821E-5,7.1362181341955225E-3,2.8080730164507572E-7,1.011668040178769E-3,1.1766398043466945E-6,2.9423499632619376E-3]
["Other industrial machinery manufacturing","33329A",8.0761670856342857E-4,4.1758997155953902E-2,1.0646072664948427E-5,1.2051202687276876E-2,1.1883212792746804E-3,1.9771523724718392E-2,3.1929938441564264E-5,5.0473778469180787E-3,5.4657022703022222E-7,7.2141102508989038E-4,0,2.1048741171058763E-3]
["Copper rolling, drawing, extruding and alloying",331420,1.6169370117072781E-2,0.23016143032767872,5.5043060234531435E-5,8.6626716516943369E-2,7.9874985290892195E-3,0.48110144413690964,6.6986896286016107E-5,6.2507472665446151E-2,2.2371335484880575E-4,3.991485619322741E-3,8.9685340720003202E-5,1.1953259348303534E-2]
{"$rows_left_out":39}
{"sheet":"Ranking","index":8,"n_rows":70,"n_cols":8,"rows_kept":70,"cut":false,"hidden":true,"merged":[]}
["BANKS","TOTAL","% TOTAL",null,null,"BANKS","TOTAL","% TOTAL"]
["SECTORS",null,null,null,null,"Pessoa Fisica",743949400,38.969206922267666]
["Setor Publico",77064705.5,4.036767090655788,null,null,"Demais servicos",75698932.795288742,3.9652258283889212]
["Petroquimica",28678654.5,1.5022317666533809,null,null,"Transporte e armazenagens",41633871,2.180845812865766]
["Adm Direta",20221701,1.0592436133280396,null,null,"Construcao civil",34960665,1.8312930805846217]
["Saneamento e Infraestrutura",17908102,0.93805376067656665,null,null,"Atividades imbiliarias, alugueis e servicos prestados as empresas",29820909,1.5620648036427129]
["Producao e distribuicao de energia eletrica",7956402,0.41676850051192238,null,null,"Petroquimica",28678654.5,1.5022317666533809]
["Outros",2191809,0.11481030625885118,null,null,"Siderurgica, metalurgica e mecanica",28636781,1.5000383687071501]
["Setor Privado",null,null,null,null,"Alimenticia e bebidas",25070395,1.3132256177341963]
["Industry",210634140.62670535,11.033338303621331,null,null,"Comercio varejista",23941352,1.2540846193126129]
{"$rows_left_out":61}
{"sheet":"Sheet3","index":9,"n_rows":70,"n_cols":3,"rows_kept":70,"cut":false,"hidden":true,"merged":[]}
["BANKS"]
["SECTORS","TOTAL","% TOTAL"]
["Setor Publico",77064705.5,4.036767090655788]
["Adm Direta",28678654.5,1.5022317666533809]
["Petroquimica",20221701,1.0592436133280396]
["Producao e distribuicao de energia eletrica",17908102,0.93805376067656665]
["Saneamento e Infraestrutura",7956402,0.41676850051192238]
["Outros",2191809,0.11481030625885118]
["Setor Privado"]
["Industry",210634140.62670535,11.033338303621331]
{"$rows_left_out":61}
{"sheet":"Bradesco","index":10,"n_rows":54,"n_cols":3,"rows_kept":54,"cut":false,"hidden":true,"merged":[[0,1,0,2]]}
[null,"Bradesco"]
[null,null,"%"]
["Setor Publico"]
["Petroquimica",6126977,{"$f":"(B4/$B$54)*100","v":1.8641845343329724}]
["Producao e distribuicao de energia eletrica",29916,9.1021958347656945E-3]
["Saneamento e Infraestrutura",null,0]
["Outros",null,0]
["Setor Privado",null,0]
["Industry",null,0]
["Alimenticia e bebidas",13868061,4.2194747650246205]
{"$rows_left_out":45}
{"sheet":"CEF","index":11,"n_rows":27,"n_cols":3,"rows_kept":27,"cut":false,"hidden":true,"merged":[]}
["Setor"]
["Setor Publico",37076753]
["Adm direta",20202347,{"$f":"(B3/$B$27)*100","v":4.0875822186388762}]
["Petroquimico",11241113,{"$f":"(B4/$B$27)*100","v":2.2744374015806339}]
["Saneamento e Infraestrutura",3643837,0.73726499840926552]
["Outros",1989456,0.40253070449509776]
["Setor Privado"]
["Pessoa Juridica"]
["Comercio varejista",23923477,4.8404860679413204]
["Contrucao civil",11450176,2.3167375462804207]
{"$rows_left_out":18}
{"sheet":"HSBC","index":12,"n_rows":32,"n_cols":26,"rows_kept":32,"cut":false,"hidden":true,"merged":[]}
["Industria",19301,{"$f":"(B1/B32)*100","v":3.4640013783498569}]
["Alimentos e bebidas",4637,{"$f":"(B2/$B$32)*100","v":0.83221462055894957}]
["Quimica e petroquimica",4209,{"$f":"(B3/$B$32)*100","v":0.7554003316654343}]
["Maquinas e equipamentos",1971,0.35374056871289405]
["Papel e celulose",963,0.17283215001040941]
["Textil e confeccoes",950,0.17049900572158769]
["Siderurgia e metalurgia",771,0.13837340359088854]
["Eletricidade gas e agua",320,5.7431244032534801E-2]
["Eletroeletronicas",916,0.16439693604313085]
["Madeiras e moveis",301,5.4021263918103045E-2]
{"$rows_left_out":23}
{"sheet":"All","index":13,"n_rows":83,"n_cols":16,"rows_kept":83,"cut":false,"hidden":true,"merged":[[0,14,0,15],[0,4,0,5],[0,6,0,7],[0,8,0,9],[0,10,0,11],[0,12,0,13]]}
["BANKS",null,null,null,"Bradesco",null,"Caixa Economica Federal",null,"HSBC",null,"Santander",null,"Banco do Brasil",null,"Itau"]
["Setores","Sectors","TC Sectors ","TC Sector number",null,"%",null,"% ",null,"%",null,"%",null,"%",null,"%"]
["Setor Publico",null,null,null,{"$f":"SUM(E4:E12)","v":8347885},{"$f":"SUM(F4:F9)","v":2.3057995772306716},{"$f":"SUM(G4:G12)","v":49827002},{"$f":"SUM(H4:H12)","v":8.9267050510040686},{"$f":"SUM(I4:I12)","v":2104.5},{"$f":"SUM(J4:J12)","v":1.7717703812526571},108037,{"$f":"(K3/$K$83)*100","v":4.7195099115037616E-2},{"$f":"SUM(M4:M12)","v":48426},{"$f":"SUM(N4:N12)","v":6.2671639743546601},{"$f":"SUM(O4:O12)","v":18731251},{"$f":"SUM(P4:P12)","v":3.094780847772403}]
["Adm Direta","Direct adm",null,null,null,null,20202347,{"$f":"(G4/$G$83)*100","v":3.6193305992408873},null,null,null,null,19354,{"$f":"(M4/$M$83)*100","v":2.5047431454107318}]
["Petroquimica","Petrochemicals","Petrochemical manufacturing",325110,{"$f":"6126977+2190992","v":8317969},{"$f":"1.86+0.44","v":2.3000000000000003},{"$f":"11241113+2190992","v":13432105},{"$f":"(G5/$G$83)*100","v":2.4064148902459954},2104.5,{"$f":"(I5/$I$83)*100","v":1.7717703812526571},null,null,null,{"$f":"(M5/$M$83)*100","v":0},{"$f":"(6398104/2)+3727424","v":6926476},{"$f":"(O5/$O$83)*100","v":1.144393680238186}]
["Producao e distribuicao de energia eletrica","Production and Distribution of electric energy","Hydroelectric Power Generation",221111,29916,{"$f":"(E6/$E$83)*100","v":5.799577230671359E-3},7845936,{"$f":"(G6/$G$83)*100","v":1.4056305559193518},null,{"$f":"(I6/$I$83)*100","v":0},null,null,29072,{"$f":"(M6/$M$83)*100","v":3.7624208289439283},51478,{"$f":"(O6/$O$83)*100","v":8.5052049370128967E-3}]
[null,null,"Electric Power distribution",221122]
[null,null,"Electric Bulk Power Transmission and Control",221121]
["Saneamento e Infraestrutura","Sanitation and Infrastructure","Water Supply and Irrigation Systems and Steam and Air-Conditioning Supply","221300A",null,{"$f":"(E9/$E$83)*100","v":0},{"$f":"3643837+2713321","v":6357158},{"$f":"(G9/$G$83)*100","v":1.1389100718648679},null,{"$f":"(I9/$I$83)*100","v":0},null,null,null,{"$f":"(M9/$M$83)*100","v":0},{"$f":"6638648+4912296","v":11550944},{"$f":"(O9/$O$83)*100","v":1.9084491615050991}]
[null,null,"Water transportation",483000]
{"$rows_left_out":73}